Jump to content


Photo

edision os mio 4k openpli 7.1 build failure


  • Please log in to reply
1 reply to this topic

#1 ebo

  • New Member
  • 1 posts

0
Neutral

Posted 4 December 2019 - 13:24

I'm trying to build 7.1 on ubuntu 18.04 and getting a failure. Here's the relevent cooker log message:

 

ERROR: linux-edision-4.20-r0 do_compile: oe_runmake failed
ERROR: linux-edision-4.20-r0 do_compile: Function failed: do_compile (log file is located at /home/elmo/oe71/openpli-oe-core/build/tmp/work/osmio4k-oe-linux/linux-edision/4.20-r0/temp/log.do_compile.9529)
ERROR: Logfile of failure stored in: /home/elmo/oe71/openpli-oe-core/build/tmp/work/osmio4k-oe-linux/linux-edision/4.20-r0/temp/log.do_compile.9529
NOTE: recipe linux-edision-4.20-r0: task do_compile: Failed
ERROR: Task (/home/elmo/oe71/openpli-oe-core/meta-edision/recipes-kernel/linux/linux-edision_4.20.bb:do_compile) failed with exit code '1'
 

Here is the compile log:

DEBUG: Executing shell function do_compile
NOTE: make -j 4 HOSTCC=gcc  HOSTCPP=gcc  -E Image.gz CC=aarch64-oe-linux-gcc   -fuse-ld=bfd  --sysroot=/home/elmo/oe71/openpli-oe-core/build/tmp/work/osmio4k-oe-linux/linux-edision/4.20-r0/recipe-sysroot LD=aarch64-oe-linux-ld.bfd    --sysroot=/home/elmo/oe71/openpli-oe-core/build/tmp/work/osmio4k-oe-linux/linux-edision/4.20-r0/recipe-sysroot
ERROR: oe_runmake failed
  GEN     Makefile
scripts/kconfig/conf  --syncconfig Kconfig
  GEN     Makefile
  UPD     include/config/kernel.release
  UPD     include/generated/uapi/linux/version.h
  Using /home/elmo/oe71/openpli-oe-core/build/tmp/work-shared/osmio4k/kernel-source as source for kernel
  UPD     include/generated/utsrelease.h
  WRAP    arch/arm64/include/generated/uapi/asm/errno.h
  WRAP    arch/arm64/include/generated/uapi/asm/ioctls.h
  WRAP    arch/arm64/include/generated/uapi/asm/ioctl.h
  WRAP    arch/arm64/include/generated/uapi/asm/ipcbuf.h
  WRAP    arch/arm64/include/generated/uapi/asm/mman.h
  WRAP    arch/arm64/include/generated/uapi/asm/kvm_para.h
  WRAP    arch/arm64/include/generated/uapi/asm/msgbuf.h
  WRAP    arch/arm64/include/generated/uapi/asm/poll.h
  WRAP    arch/arm64/include/generated/uapi/asm/resource.h
  WRAP    arch/arm64/include/generated/uapi/asm/shmbuf.h
  WRAP    arch/arm64/include/generated/uapi/asm/sembuf.h
  WRAP    arch/arm64/include/generated/uapi/asm/socket.h
  WRAP    arch/arm64/include/generated/uapi/asm/swab.h
  WRAP    arch/arm64/include/generated/uapi/asm/sockios.h
  WRAP    arch/arm64/include/generated/uapi/asm/termbits.h
  WRAP    arch/arm64/include/generated/uapi/asm/termios.h
  WRAP    arch/arm64/include/generated/uapi/asm/siginfo.h
  WRAP    arch/arm64/include/generated/uapi/asm/types.h
  HOSTCC  scripts/dtc/flattree.o
  HOSTCC  scripts/dtc/dtc.o
  HOSTCC  scripts/dtc/fstree.o
  WRAP    arch/arm64/include/generated/asm/bugs.h
  WRAP    arch/arm64/include/generated/asm/delay.h
  WRAP    arch/arm64/include/generated/asm/div64.h
  WRAP    arch/arm64/include/generated/asm/dma.h
  WRAP    arch/arm64/include/generated/asm/dma-contiguous.h
  WRAP    arch/arm64/include/generated/asm/early_ioremap.h
  WRAP    arch/arm64/include/generated/asm/emergency-restart.h
  WRAP    arch/arm64/include/generated/asm/errno.h
  WRAP    arch/arm64/include/generated/asm/fncpy.h
  WRAP    arch/arm64/include/generated/asm/hw_irq.h
  WRAP    arch/arm64/include/generated/asm/irq_regs.h
  WRAP    arch/arm64/include/generated/asm/kdebug.h
  WRAP    arch/arm64/include/generated/asm/kmap_types.h
  WRAP    arch/arm64/include/generated/asm/local.h
  WRAP    arch/arm64/include/generated/asm/local64.h
  WRAP    arch/arm64/include/generated/asm/mcs_spinlock.h
  WRAP    arch/arm64/include/generated/asm/mm-arch-hooks.h
  WRAP    arch/arm64/include/generated/asm/msi.h
  WRAP    arch/arm64/include/generated/asm/preempt.h
  WRAP    arch/arm64/include/generated/asm/qrwlock.h
  WRAP    arch/arm64/include/generated/asm/qspinlock.h
  WRAP    arch/arm64/include/generated/asm/rwsem.h
  WRAP    arch/arm64/include/generated/asm/segment.h
  WRAP    arch/arm64/include/generated/asm/serial.h
  WRAP    arch/arm64/include/generated/asm/set_memory.h
  WRAP    arch/arm64/include/generated/asm/sizes.h
  WRAP    arch/arm64/include/generated/asm/switch_to.h
  WRAP    arch/arm64/include/generated/asm/trace_clock.h
  WRAP    arch/arm64/include/generated/asm/unaligned.h
  WRAP    arch/arm64/include/generated/asm/user.h
  WRAP    arch/arm64/include/generated/asm/vga.h
  WRAP    arch/arm64/include/generated/asm/xor.h
  HOSTCC  scripts/dtc/data.o
  HOSTCC  scripts/dtc/livetree.o
  HOSTCC  scripts/dtc/treesource.o
  HOSTCC  scripts/dtc/srcpos.o
  HOSTCC  scripts/dtc/checks.o
  HOSTCC  scripts/dtc/util.o
  LEX     scripts/dtc/dtc-lexer.lex.c
  YACC    scripts/dtc/dtc-parser.tab.h
  YACC    scripts/dtc/dtc-parser.tab.c
  HOSTCC  scripts/dtc/dtc-lexer.lex.o
  HOSTCC  scripts/dtc/dtc-parser.tab.o
  CC      kernel/bounds.s
  UPD     include/generated/bounds.h
  UPD     include/generated/timeconst.h
  CC      arch/arm64/kernel/asm-offsets.s
  HOSTLD  scripts/dtc/dtc
  HOSTCC  scripts/kallsyms
  HOSTCC  scripts/conmakehash
  CC      scripts/mod/empty.o
  HOSTCC  scripts/mod/mk_elfconfig
  CC      scripts/mod/devicetable-offsets.s
  HOSTCC  scripts/sortextable
  MKELF   scripts/mod/elfconfig.h
  HOSTCC  scripts/mod/modpost.o
  HOSTCC  scripts/asn1_compiler
  HOSTCC  scripts/extract-cert
/home/elmo/oe71/openpli-oe-core/build/tmp/work-shared/osmio4k/kernel-source/scripts/extract-cert.c:21:10: fatal error: openssl/bio.h: No such file or directory
 #include <openssl/bio.h>
          ^~~~~~~~~~~~~~~
compilation terminated.
scripts/Makefile.host:90: recipe for target 'scripts/extract-cert' failed
make[3]: *** [scripts/extract-cert] Error 1
make[3]: *** Waiting for unfinished jobs....
  UPD     scripts/mod/devicetable-offsets.h
  HOSTCC  scripts/mod/sumversion.o
  HOSTCC  scripts/mod/file2alias.o
  HOSTLD  scripts/mod/modpost
/home/elmo/oe71/openpli-oe-core/build/tmp/work-shared/osmio4k/kernel-source/Makefile:1070: recipe for target 'scripts' failed
make[2]: *** [scripts] Error 2
make[2]: *** Waiting for unfinished jobs....
  UPD     include/generated/asm-offsets.h
  CALL    /home/elmo/oe71/openpli-oe-core/build/tmp/work-shared/osmio4k/kernel-source/scripts/checksyscalls.sh
Makefile:152: recipe for target 'sub-make' failed
make[1]: *** [sub-make] Error 2
Makefile:15: recipe for target '__sub-make' failed
make: *** [__sub-make] Error 2
WARNING: exit code 1 from a shell command.
ERROR: Function failed: do_compile (log file is located at /home/elmo/oe71/openpli-oe-core/build/tmp/work/osmio4k-oe-linux/linux-edision/4.20-r0/temp/log.do_compile.9529)

Any help?

Thanks



Re: edision os mio 4k openpli 7.1 build failure #2 WanWizard

  • Forum Moderator
    PLi® Core member
  • 49,495 posts

+873
Excellent

Posted 4 December 2019 - 17:02

You may miss libssl-dev ...


Currently in use: VU+Duo 4K (2xFBC S2), Amiko Viper T2C (T2), SAB Alpha Triple HD (S2+T2), Zgemma H3.T2C (T/C), Zgemma H6 (fallback), VU+Zero (fallback)

Many answers to your question can be found in our new and improved wiki.

note: I do not provide support via PM !

 





0 user(s) are reading this topic

0 members, 0 guests, 0 anonymous users