Jump to content


Photo

Error beim bauen vom Vu+ Solose Image.


  • Please log in to reply
116 replies to this topic

Re: Error beim bauen vom Vu+ Solose Image. #101 rantanplan

  • Senior Member
  • 741 posts

+38
Good

Posted 21 April 2021 - 13:33

I'm not sure, but since it's the qtbase ...
This is definitely an out of memory problem.
He should install an adaptive size swap on his Ubuntu.



Re: Error beim bauen vom Vu+ Solose Image. #102 enrico74

  • Senior Member
  • 69 posts

0
Neutral

Posted 22 April 2021 - 07:12

 FAILED: lib/libQt5WebKit.so.5.212.0
| cd /home/enri74/Scaricati/openpli-oe-core/build/tmp/work/sf8008-oe-linux-gnueabi/qtwebkit/5.13.2+gitAUTOINC+ab1bd15209-r0/build/Source/WebKit && /home/enri74/Scaricati/openpli-oe-core/build/tmp/work/sf8008-oe-linux-gnueabi/qtwebkit/5.13.2+gitAUTOINC+ab1bd15209-r0/recipe-sysroot-native/usr/bin/perl-native/perl /home/enri74/Scaricati/openpli-oe-core/build/tmp/work/sf8008-oe-linux-gnueabi/qtwebkit/5.13.2+gitAUTOINC+ab1bd15209-r0/git/Tools/qt/generate-version-script.pl 5.13.2 > /home/enri74/Scaricati/openpli-oe-core/build/tmp/work/sf8008-oe-linux-gnueabi/qtwebkit/5.13.2+gitAUTOINC+ab1bd15209-r0/build/QtWebKit.version && cd /home/enri74/Scaricati/openpli-oe-core/build/tmp/work/sf8008-oe-linux-gnueabi/qtwebkit/5.13.2+gitAUTOINC+ab1bd15209-r0/build && /home/enri74/Scaricati/openpli-oe-core/build/tmp/work/sf8008-oe-linux-gnueabi/qtwebkit/5.13.2+gitAUTOINC+ab1bd15209-r0/recipe-sysroot-native/usr/bin/arm-oe-linux-gnueabi/arm-oe-linux-gnueabi-g++ -fPIC -fvisibility=hidden -fvisibility-inlines-hidden  -mfpu=neon-vfpv4 -mfloat-abi=hard -mcpu=cortex-a15  --sysroot=/home/enri74/Scaricati/openpli-oe-core/build/tmp/work/sf8008-oe-linux-gnueabi/qtwebkit/5.13.2+gitAUTOINC+ab1bd15209-r0/recipe-sysroot  -Os -pipe -g -feliminate-unused-debug-types -fmacro-prefix-map=/home/enri74/Scaricati/openpli-oe-core/build/tmp/work/sf8008-oe-linux-gnueabi/qtwebkit/5.13.2+gitAUTOINC+ab1bd15209-r0=/usr/src/debug/qtwebkit/5.13.2+gitAUTOINC+ab1bd15209-r0                      -fdebug-prefix-map=/home/enri74/Scaricati/openpli-oe-core/build/tmp/work/sf8008-oe-linux-gnueabi/qtwebkit/5.13.2+gitAUTOINC+ab1bd15209-r0=/usr/src/debug/qtwebkit/5.13.2+gitAUTOINC+ab1bd15209-r0                      -fdebug-prefix-map=/home/enri74/Scaricati/openpli-oe-core/build/tmp/work/sf8008-oe-linux-gnueabi/qtwebkit/5.13.2+gitAUTOINC+ab1bd15209-r0/recipe-sysroot=                      -fdebug-prefix-map=/home/enri74/Scaricati/openpli-oe-core/build/tmp/work/sf8008-oe-linux-gnueabi/qtwebkit/5.13.2+gitAUTOINC+ab1bd15209-r0/recipe-sysroot-native=  -fvisibility-inlines-hidden  -mfpu=neon-vfpv4 -mfloat-abi=hard -mcpu=cortex-a15  --sysroot=/home/enri74/Scaricati/openpli-oe-core/build/tmp/work/sf8008-oe-linux-gnueabi/qtwebkit/5.13.2+gitAUTOINC+ab1bd15209-r0/recipe-sysroot -fpermissive -fno-exceptions -fno-strict-aliasing -fno-rtti -std=c++11 -Wno-expansion-to-defined  -Wl,--no-undefined -Wl,-O1 -Wl,--hash-style=gnu -Wl,--as-needed -Wl,--version-script,/home/enri74/Scaricati/openpli-oe-core/build/tmp/work/sf8008-oe-linux-gnueabi/qtwebkit/5.13.2+gitAUTOINC+ab1bd15209-r0/build/QtWebKit.version -shared -Wl,-soname,libQt5WebKit.so.5 -o lib/libQt5WebKit.so.5.212.0 Source/WebKit/CMakeFiles/WebKit.dir/WebKit_autogen/mocs_compilation.cpp.o Source/WebKit/CMakeFiles/WebKit.dir/Storage/StorageAreaImpl.cpp.o Source/WebKit/CMakeFiles/WebKit.dir/Storage/StorageAreaSync.cpp.o Source/WebKit/CMakeFiles/WebKit.dir/Storage/StorageNamespaceImpl.cpp.o Source/WebKit/CMakeFiles/WebKit.dir/Storage/StorageSyncManager.cpp.o Source/WebKit/CMakeFiles/WebKit.dir/Storage/StorageThread.cpp.o Source/WebKit/CMakeFiles/WebKit.dir/Storage/StorageTracker.cpp.o Source/WebKit/CMakeFiles/WebKit.dir/Storage/WebDatabaseProvider.cpp.o Source/WebKit/CMakeFiles/WebKit.dir/Storage/WebStorageNamespaceProvider.cpp.o Source/WebKit/CMakeFiles/WebKit.dir/WebCoreSupport/WebResourceLoadScheduler.cpp.o Source/WebKit/CMakeFiles/WebKit.dir/qt/Api/qhttpheader.cpp.o Source/WebKit/CMakeFiles/WebKit.dir/qt/Api/qwebdatabase.cpp.o Source/WebKit/CMakeFiles/WebKit.dir/qt/Api/qwebelement.cpp.o Source/WebKit/CMakeFiles/WebKit.dir/qt/Api/qwebfullscreenrequest.cpp.o Source/WebKit/CMakeFiles/WebKit.dir/qt/Api/qwebhistory.cpp.o Source/WebKit/CMakeFiles/WebKit.dir/qt/Api/qwebhistoryinterface.cpp.o Source/WebKit/CMakeFiles/WebKit.dir/qt/Api/qwebkitglobal.cpp.o Source/WebKit/CMakeFiles/WebKit.dir/qt/Api/qwebplugindatabase.cpp.o Source/WebKit/CMakeFiles/WebKit.dir/qt/Api/qwebpluginfactory.cpp.o Source/WebKit/CMakeFiles/WebKit.dir/qt/Api/qwebscriptworld.cpp.o Source/WebKit/CMakeFiles/WebKit.dir/qt/Api/qwebsecurityorigin.cpp.o Source/WebKit/CMakeFiles/WebKit.dir/qt/Api/qwebsettings.cpp.o Source/WebKit/CMakeFiles/WebKit.dir/qt/WebCoreSupport/ChromeClientQt.cpp.o Source/WebKit/CMakeFiles/WebKit.dir/qt/WebCoreSupport/ContextMenuClientQt.cpp.o Source/WebKit/CMakeFiles/WebKit.dir/qt/WebCoreSupport/DragClientQt.cpp.o Source/WebKit/CMakeFiles/WebKit.dir/qt/WebCoreSupport/EditorClientQt.cpp.o Source/WebKit/CMakeFiles/WebKit.dir/qt/WebCoreSupport/FrameLoaderClientQt.cpp.o Source/WebKit/CMakeFiles/WebKit.dir/qt/WebCoreSupport/FrameNetworkingContextQt.cpp.o Source/WebKit/CMakeFiles/WebKit.dir/qt/WebCoreSupport/HistorySerialization.cpp.o Source/WebKit/CMakeFiles/WebKit.dir/qt/WebCoreSupport/IconDatabaseClientQt.cpp.o Source/WebKit/CMakeFiles/WebKit.dir/qt/WebCoreSupport/InitWebCoreQt.cpp.o Source/WebKit/CMakeFiles/WebKit.dir/qt/WebCoreSupport/InspectorClientQt.cpp.o Source/WebKit/CMakeFiles/WebKit.dir/qt/WebCoreSupport/InspectorServerQt.cpp.o Source/WebKit/CMakeFiles/WebKit.dir/qt/WebCoreSupport/NotificationPresenterClientQt.cpp.o Source/WebKit/CMakeFiles/WebKit.dir/qt/WebCoreSupport/PlatformStrategiesQt.cpp.o Source/WebKit/CMakeFiles/WebKit.dir/qt/WebCoreSupport/PopupMenuQt.cpp.o Source/WebKit/CMakeFiles/WebKit.dir/qt/WebCoreSupport/ProgressTrackerClientQt.cpp.o Source/WebKit/CMakeFiles/WebKit.dir/qt/WebCoreSupport/QWebFrameAdapter.cpp.o Source/WebKit/CMakeFiles/WebKit.dir/qt/WebCoreSupport/QWebFrameData.cpp.o Source/WebKit/CMakeFiles/WebKit.dir/qt/WebCoreSupport/QWebPageAdapter.cpp.o Source/WebKit/CMakeFiles/WebKit.dir/qt/WebCoreSupport/QtPlatformPlugin.cpp.o Source/WebKit/CMakeFiles/WebKit.dir/qt/WebCoreSupport/QtPluginWidgetAdapter.cpp.o Source/WebKit/CMakeFiles/WebKit.dir/qt/WebCoreSupport/QtPrintContext.cpp.o Source/WebKit/CMakeFiles/WebKit.dir/qt/WebCoreSupport/SearchPopupMenuQt.cpp.o Source/WebKit/CMakeFiles/WebKit.dir/qt/WebCoreSupport/TextCheckerClientQt.cpp.o Source/WebKit/CMakeFiles/WebKit.dir/qt/WebCoreSupport/TextureMapperLayerClientQt.cpp.o Source/WebKit/CMakeFiles/WebKit.dir/qt/WebCoreSupport/UndoStepQt.cpp.o Source/WebKit/CMakeFiles/WebKit.dir/qt/WebCoreSupport/VisitedLinkStoreQt.cpp.o Source/WebKit/CMakeFiles/WebKit.dir/qt/WebCoreSupport/WebDatabaseProviderQt.cpp.o Source/WebKit/CMakeFiles/WebKit.dir/qt/WebCoreSupport/WebEventConversion.cpp.o Source/WebKit/CMakeFiles/WebKit.dir/win/Plugins/PluginDatabase.cpp.o Source/WebKit/CMakeFiles/WebKit.dir/win/Plugins/PluginDebug.cpp.o Source/WebKit/CMakeFiles/WebKit.dir/win/Plugins/PluginPackage.cpp.o Source/WebKit/CMakeFiles/WebKit.dir/win/Plugins/PluginStream.cpp.o Source/WebKit/CMakeFiles/WebKit.dir/win/Plugins/PluginView.cpp.o Source/WebKit/CMakeFiles/WebKit.dir/win/Plugins/PluginMainThreadScheduler.cpp.o Source/WebKit/CMakeFiles/WebKit.dir/win/Plugins/npapi.cpp.o Source/WebKit/CMakeFiles/WebKit.dir/qt/Plugins/PluginPackageQt.cpp.o Source/WebKit/CMakeFiles/WebKit.dir/qt/Plugins/PluginViewQt.cpp.o Source/WebKit/CMakeFiles/WebKit.dir/qrc_WebCore.cpp.o  lib/libJavaScriptCore.a lib/libWTF.a lib/libWebCore.a -licuuc /home/enri74/Scaricati/openpli-oe-core/build/tmp/work/sf8008-oe-linux-gnueabi/qtwebkit/5.13.2+gitAUTOINC+ab1bd15209-r0/recipe-sysroot/usr/lib/libQt5Gui.so.5.13.2 /home/enri74/Scaricati/openpli-oe-core/build/tmp/work/sf8008-oe-linux-gnueabi/qtwebkit/5.13.2+gitAUTOINC+ab1bd15209-r0/recipe-sysroot/usr/lib/libQt5Network.so.5.13.2 lib/libJavaScriptCore.a lib/libWTF.a -licui18n lib/libbmalloc.a -ldl -lpthread /home/enri74/Scaricati/openpli-oe-core/build/tmp/work/sf8008-oe-linux-gnueabi/qtwebkit/5.13.2+gitAUTOINC+ab1bd15209-r0/recipe-sysroot/usr/lib/libQt5Core.so.5.13.2 lib/libwoff2.a lib/libbrotli.a -ljpeg -lpng -lz -lwebp -lxml2 -lxslt -lsqlite3 -ljpeg -lpng -lz -lwebp -lxml2 -lxslt -lsqlite3 -licuuc /home/enri74/Scaricati/openpli-oe-core/build/tmp/work/sf8008-oe-linux-gnueabi/qtwebkit/5.13.2+gitAUTOINC+ab1bd15209-r0/recipe-sysroot/usr/lib/libEGL.so /home/enri74/Scaricati/openpli-oe-core/build/tmp/work/sf8008-oe-linux-gnueabi/qtwebkit/5.13.2+gitAUTOINC+ab1bd15209-r0/recipe-sysroot/usr/lib/libGLESv2.so lib/libANGLESupport.a && :
| collect2: fatal error: ld terminated with signal 9 [Killed]
| compilation terminated.
| ninja: build stopped: subcommand failed.
| WARNING: /home/enri74/Scaricati/openpli-oe-core/build/tmp/work/sf8008-oe-linux-gnueabi/qtwebkit/5.13.2+gitAUTOINC+ab1bd15209-r0/temp/run.do_compile.16775:1 exit 1 from 'eval ${DESTDIR:+DESTDIR=${DESTDIR} }VERBOSE=1 cmake --build '/home/enri74/Scaricati/openpli-oe-core/build/tmp/work/sf8008-oe-linux-gnueabi/qtwebkit/5.13.2+gitAUTOINC+ab1bd15209-r0/build' "$@" -- -j 8'
ERROR: Task (/home/enri74/Scaricati/openpli-oe-core/meta-qt5/recipes-qt/qt5/qtwebkit_git.bb:do_compile) failed with exit code '1'
NOTE: Tasks Summary: Attempted 11156 tasks of which 10755 didn't need to be rerun and 1 failed.
 
Summary: 1 task failed:
  /home/enri74/Scaricati/openpli-oe-core/meta-qt5/recipes-qt/qt5/qtwebkit_git.bb:do_compile
Summary: There was 1 WARNING message shown.
Summary: There was 1 ERROR message shown, returning a non-zero exit code.
Makefile:132: recipe for target 'feed' failed
make: *** [feed] Error 1
enri74@enri74-Aspire-5755G:~/Scaricati/openpli-oe-core$ 


Re: Error beim bauen vom Vu+ Solose Image. #103 rantanplan

  • Senior Member
  • 741 posts

+38
Good

Posted 22 April 2021 - 10:36

| collect2: fatal error: ld terminated with signal 9 [Killed]

As mentioned above,

Your build PC lacks memory!

You have to do more swap.
I would have this done adaptively in Ubuntu.

 



Re: Error beim bauen vom Vu+ Solose Image. #104 enrico74

  • Senior Member
  • 69 posts

0
Neutral

Posted 23 April 2021 - 09:07

ok grazie del informarmazione



Re: Error beim bauen vom Vu+ Solose Image. #105 enrico74

  • Senior Member
  • 69 posts

0
Neutral

Posted 24 April 2021 - 06:14

Buongiorno ho rinstallato Ubuntu nuovo e adesso rinscontro un problema quando metto la =MACHINE=sf8008 make image

non partemi da questo errore mi sa dire cosa puo essere grazie mille

 

 

 

enri74@enri74-Aspire-5755G:~$ cd Documenti
enri74@enri74-Aspire-5755G:~/Documenti$ cd openpli-oe-core
enri74@enri74-Aspire-5755G:~/Documenti/openpli-oe-core$ MACHINE=sf8008 make image
Building image for sf8008
ERROR: Unable to start bitbake server (None)
ERROR: Server log for this session (/home/enri74/Documenti/openpli-oe-core/build/bitbake-cookerdaemon.log):
--- Starting bitbake server pid 1887 at 2021-04-24 07:08:34.521540 ---
ERROR: The following required tools (as specified by HOSTTOOLS) appear to be unavailable in PATH, please install them in order to proceed:
  g++ makeinfo rpcgen svn

Makefile:128: recipe for target 'image' failed
make: *** [image] Error 1
enri74@enri74-Aspire-5755G:~/Documenti/openpli-oe-core$
 



Re: Error beim bauen vom Vu+ Solose Image. #106 betacentauri

  • PLi® Core member
  • 6,966 posts

+299
Excellent

Posted 24 April 2021 - 07:22

I don’t understand what you write, but the solution stands in the error message. You only have to read it ;)
“ERROR: The following required tools (as specified by HOSTTOOLS) appear to be unavailable in PATH, please install them in order to proceed:
g++ makeinfo rpcgen svn”

Execute this in a terminal:
sudo apt-get install g++ makeinfo rpcgen svn
Xtrend ET-9200, ET-8000, ET-10000, OpenPliPC on Ubuntu 12.04

Re: Error beim bauen vom Vu+ Solose Image. #107 enrico74

  • Senior Member
  • 69 posts

0
Neutral

Posted 24 April 2021 - 13:46

Ciao

betacentauri

lo faccio ma mi da sempre lo stesso errore quando metto a compilare

 

enri74@enri74-Aspire-5755G:~$ cd Documenti
enri74@enri74-Aspire-5755G:~/Documenti$ cd openpli-oe-core
enri74@enri74-Aspire-5755G:~/Documenti/openpli-oe-core$ make update
Updating Git repositories...
Already up to date.
Synchronizing submodule url for 'bitbake'
Synchronizing submodule url for 'meta-amiko'
Synchronizing submodule url for 'meta-axasuhd'
Synchronizing submodule url for 'meta-dream'
Synchronizing submodule url for 'meta-edision'
Synchronizing submodule url for 'meta-formuler'
Synchronizing submodule url for 'meta-gfutures'
Synchronizing submodule url for 'meta-gi'
Synchronizing submodule url for 'meta-gigablue'
Synchronizing submodule url for 'meta-maxytec'
Synchronizing submodule url for 'meta-miraclebox'
Synchronizing submodule url for 'meta-octagon'
Synchronizing submodule url for 'meta-openembedded'
Synchronizing submodule url for 'meta-qt5'
Synchronizing submodule url for 'meta-qviart'
Synchronizing submodule url for 'meta-sab'
Synchronizing submodule url for 'meta-spycat'
Synchronizing submodule url for 'meta-uclan'
Synchronizing submodule url for 'meta-vuplus'
Synchronizing submodule url for 'meta-xp'
Synchronizing submodule url for 'meta-xpeedc'
Synchronizing submodule url for 'meta-xsarius.pli5'
Synchronizing submodule url for 'meta-xtrend'
Synchronizing submodule url for 'meta-zgemma'
Synchronizing submodule url for 'openembedded-core'
The openpli OE is now up-to-date.
enri74@enri74-Aspire-5755G:~/Documenti/openpli-oe-core$ MACHINE=sf8008 make image
Building image for sf8008
ERROR: Unable to start bitbake server (None)
ERROR: Server log for this session (/home/enri74/Documenti/openpli-oe-core/build/bitbake-cookerdaemon.log):
--- Starting bitbake server pid 2581 at 2021-04-24 14:43:59.735410 ---
ERROR: The following required tools (as specified by HOSTTOOLS) appear to be unavailable in PATH, please install them in order to proceed:
  g++ makeinfo rpcgen svn

Makefile:128: recipe for target 'image' failed
make: *** [image] Error 1
enri74@enri74-Aspire-5755G:~/Documenti/openpli-oe-core$ sudo apt-get install g++ makeinfo rpcgen svn
[sudo] password di enri74:           
Lettura elenco dei pacchetti... Fatto
Generazione albero delle dipendenze       
Lettura informazioni sullo stato... Fatto
Il pacchetto svn non ha versioni disponibili, ma è nominato da un altro
pacchetto. Questo potrebbe indicare che il pacchetto è mancante, obsoleto
oppure è disponibile solo all'interno di un'altra sorgente

E: Impossibile trovare il pacchetto makeinfo
E: Impossibile trovare il pacchetto rpcgen
E: Il pacchetto "svn" non ha candidati da installare
enri74@enri74-Aspire-5755G:~/Documenti/openpli-oe-core$
 



Re: Error beim bauen vom Vu+ Solose Image. #108 betacentauri

  • PLi® Core member
  • 6,966 posts

+299
Excellent

Posted 24 April 2021 - 15:47

sudo apt-get install texinfo subversion rpcbind build-essential

This might help.
Xtrend ET-9200, ET-8000, ET-10000, OpenPliPC on Ubuntu 12.04

Re: Error beim bauen vom Vu+ Solose Image. #109 enrico74

  • Senior Member
  • 69 posts

0
Neutral

Posted 24 April 2021 - 17:57

ciao 

betacentauri  grazie per l'aiuto a fatto un passo avanti ma mi a dato adesso questo errore.

 

enri74@enri74-Aspire-5755G:~/Documenti/openpli-oe-core$ MACHINE=sf8008 make image

Generating /home/enri74/Documenti/openpli-oe-core/build/env.source
Generating /home/enri74/Documenti/openpli-oe-core/build/conf/openpli.conf
Generating /home/enri74/Documenti/openpli-oe-core/build/conf/bblayers.conf
Generating /home/enri74/Documenti/openpli-oe-core/build/conf/local.conf
Building image for sf8008
NOTE: Your conf/bblayers.conf has been automatically updated.
NOTE: Your conf/bblayers.conf has been automatically updated.
ERROR:  OE-core's config sanity checker detected a potential misconfiguration.
    Either fix the cause of this error or at your own risk disable the checker (see sanity.conf).
    Following is the list of potential problems / advisories:
 
    Your Python 3 is not a full install. Please install the module distutils.sysconfig (see the Getting Started guide for further information).
 
 
Summary: There was 1 ERROR message shown, returning a non-zero exit code.
Makefile:128: recipe for target 'image' failed
make: *** [image] Error 1
enri74@enri74-Aspire-5755G:~/Documenti/openpli-oe-core$


Re: Error beim bauen vom Vu+ Solose Image. #110 betacentauri

  • PLi® Core member
  • 6,966 posts

+299
Excellent

Posted 24 April 2021 - 18:56

Please use google (like I do) to fix the problems.
Eg search for “ubuntu distutils.sysconfig”
Xtrend ET-9200, ET-8000, ET-10000, OpenPliPC on Ubuntu 12.04

Re: Error beim bauen vom Vu+ Solose Image. #111 enrico74

  • Senior Member
  • 69 posts

0
Neutral

Posted 24 April 2021 - 19:45

Ciao 

betacentauri grazie mille per l'aiuto finalmente so riusito a farlo partire  :thumbs-up: 

Re: Error beim bauen vom Vu+ Solose Image. #112 enrico74

  • Senior Member
  • 69 posts

0
Neutral

Posted 4 May 2021 - 21:52

buonasera chi mi puo aiutare da oggi sto avendo questo errore grazie

 

ERROR: openpli-enigma2-image-1.0-r0 do_rootfs: No manifest generated from: tuxbox-common in /home/enri74/Documenti/openpli-oe-core/meta-openpli/recipes-multimedia/tuxbox/tuxbox-common.bb
ERROR: Logfile of failure stored in: /home/enri74/Documenti/openpli-oe-core/build/tmp/work/sf8008-oe-linux-gnueabi/openpli-enigma2-image/1.0-r0/temp/log.do_rootfs.18316
ERROR: Task (/home/enri74/Documenti/openpli-oe-core/meta-openpli/recipes-openpli/images/openpli-enigma2-image.bb:do_rootfs) failed with exit code '1'
NOTE: Tasks Summary: Attempted 6082 tasks of which 5921 didn't need to be rerun and 1 failed.
 
Summary: 1 task failed:
  /home/enri74/Documenti/openpli-oe-core/meta-openpli/recipes-openpli/images/openpli-enigma2-image.bb:do_rootfs
Summary: There was 1 WARNING message shown.
Summary: There was 1 ERROR message shown, returning a non-zero exit code.
Makefile:132: recipe for target 'feed' failed
make: *** [feed] Error 1
enri74@enri74-Aspire-5755G:~/Documenti/openpli-oe-core$ 


Re: Error beim bauen vom Vu+ Solose Image. #113 rantanplan

  • Senior Member
  • 741 posts

+38
Good

Posted 4 May 2021 - 22:46

update your build envirement

and rebuild Image



Re: Error beim bauen vom Vu+ Solose Image. #114 enrico74

  • Senior Member
  • 69 posts

0
Neutral

Posted 5 May 2021 - 06:47

ciao 

rantanplan grazie 

Re: Error beim bauen vom Vu+ Solose Image. #115 enrico74

  • Senior Member
  • 69 posts

0
Neutral

Posted 13 May 2021 - 10:11

update your build envirement

and rebuild Image

Hi ratanplan I encountered the same error again after a few days that everything was fine, last time I canceled build and restarted the image must do this maneuver every time because every time after I have to postpone all the images or there is a simpler way No need to delete the whole build thank you very much



Re: Error beim bauen vom Vu+ Solose Image. #116 rantanplan

  • Senior Member
  • 741 posts

+38
Good

Posted 13 May 2021 - 19:48

You don't have to build ...
But if you build images yourself, then this will be from the devolop branch and it will change.
So before every new image build, once 'make update' and then '..... ..... make image' or '..... ..... make feed'
You don't have to delete the 'build'.
On the contrary, it can stay and building a new image takes little time.



Re: Error beim bauen vom Vu+ Solose Image. #117 enrico74

  • Senior Member
  • 69 posts

0
Neutral

Posted 14 May 2021 - 06:11

Hello rantanplan thank you very much for the information






1 user(s) are reading this topic

0 members, 1 guests, 0 anonymous users