Jump to content


ostende

Member Since 22 Jan 2015
Offline Last Active 11 Nov 2020 11:01
-----

Topics I've Started

build image not succeded

4 October 2016 - 11:50

please help i try to build an image for my solo2 and i had this problem

 

 

gcc  -Wall -Wextra -Os -pipe -g -feliminate-unused-debug-types -fdebug-prefix-map=/home/openatvbuilder/openatv/build-enviroment/builds/openmips/release/vusolo2/tmp/work/mips32el-oe-linux/astra-sm/0.2-r0/git=/usr/src/astra-sm -fdebug-prefix-map=/home/openatvbuilder/openatv/build-enviroment/builds/openmips/release/vusolo2/tmp/work/mips32el-oe-linux/astra-sm/0.2-r0/git=/usr/src/astra-sm -fdebug-prefix-map=/home/openatvbuilder/openatv/build-enviroment/builds/openmips/release/vusolo2/tmp/sysroots/x86_64-linux= -fdebug-prefix-map=/home/openatvbuilder/openatv/build-enviroment/builds/openmips/release/vusolo2/tmp/sysroots/vusolo2=  -std=c99 -pthread -fomit-frame-pointer -funsafe-loop-optimizations -ffast-math -fwrapv -fstrict-aliasing -lm \

    -o tonegen ./tonegen.c
/tmp/ccBPtJcW.o: In function `main':
/usr/src/astra-sm/tools/./tonegen.c:216: undefined reference to `sin'
collect2: error: ld returned 1 exit status
Makefile:493: recipe for target 'tonegen' failed
make[1]: *** [tonegen] Error 1
make[1]: Leaving directory '/home/openatvbuilder/openatv/build-enviroment/builds/openmips/release/vusolo2/tmp/work/mips32el-oe-linux/astra-sm/0.2-r0/git/tools'
Makefile:437: recipe for target 'all-recursive' failed
make: *** [all-recursive] Error 1
WARNING: /home/openatvbuilder/openatv/build-enviroment/builds/openmips/release/vusolo2/tmp/work/mips32el-oe-linux/astra-sm/0.2-r0/temp/run.do_compile.12146:1 exit 1 from 'exit 1'
ERROR: oe_runmake failed
ERROR: Function failed: do_compile (log file is located at /home/openatvbuilder/openatv/build-enviroment/builds/openmips/release/vusolo2/tmp/work/mips32el-oe-linux/astra-sm/0.2-r0/temp/log.do_compile.12146)

 

 

i know is not openpli git but in this great forum we found always help thnx 


halo help aub

8 August 2016 - 09:51

hallo aub ik heb een problem 

 

staat nix op de maap boot dan ik heb di gedaan in telnet 

 

mount -o rw,remount /boot

 

maar komt error 

 

can't find /boot in proc/mounts

 
 
wat moet ik doen 

how to get h.265 work on solo2

20 June 2016 - 23:19

hello

 

so i have some link iptv with fhd its h.265 but it not workin on solo2 


please help

18 March 2016 - 10:37

hello 

 

today i try to unpack vuplus image with mounting ubifs but it coming error msg 

 

Attached File  Capture du 2016-03-18 10:37:59.png   617.32KB   5 downloads

 

thank you